UP 2013.09.06 06:00 UTC [PRODUCTION] [DONE]

Important informations about SolydXK including releases notes, forum rules and other anouncements
User avatar
cofiRS
Posts: 6
Joined: 30 Aug 2013 18:02
Location: Belgrade Serbia
Contact:

Re: UP 2013.09.06 06:00 UTC [PRODUCTION]

Postby cofiRS » 14 Sep 2013 15:18

Update:
Just upgraded second machine, an old Athlon XP banger. Everything went fine, except the fact that it updated to 3.10.2-486 kernel instead to 3.10.2-686-PAE, from 3.9-686-PAE, but no big deal, DDM sorted it out. :)

User avatar
stelios
Posts: 128
Joined: 28 Feb 2013 21:31
Location: Athens

Re: UP 2013.09.06 06:00 UTC [PRODUCTION]

Postby stelios » 14 Sep 2013 17:41

The update went just fine here, using the update manager. No issues. ;)

kyodev
Posts: 505
Joined: 06 Jul 2013 09:47
Location: Lyon, France

Re: UP 2013.09.06 06:00 UTC [PRODUCTION]

Postby kyodev » 14 Sep 2013 21:02

Schoelje wrote:It should have generated a new file but that didn't happen in your case.

Code: Select all

echo "2013.09.06" > /usr/lib/solydxk/updatemanager/up.hist
update solydX too, all is fine. it's necessary also to create manually up.hist with your command (solyd X&K)
.

User avatar
zerozero
Posts: 5373
Joined: 10 Feb 2013 23:37
Location: West Midlands, England
Contact:

Re: UP 2013.09.06 06:00 UTC [PRODUCTION]

Postby zerozero » 14 Sep 2013 21:13

finish upgrading the last of the 4 production VM's (K-64bit was worth around 900MB in updates); all of them are fully functional 8-)
bliss of ignorance

User avatar
Crewp
Posts: 82
Joined: 28 Aug 2013 23:06
Location: Connecticut USA

Re: UP 2013.09.06 06:00 UTC [PRODUCTION]

Postby Crewp » 14 Sep 2013 22:56

Could you do a dist-upgrade again (booted into the new "bad" kernel) to check if there is anything wrong or missing?

Code: Select all
sudo apt-get dist-upgrade
Schoelje, That worked :) All is well again,the only thing missing is the startup tune that played when booting up.

Thank you. Crewp :D

User avatar
freebeekey
Posts: 86
Joined: 22 Jul 2013 02:03
Location: In your Dreams

Re: UP 2013.09.06 06:00 UTC [PRODUCTION]

Postby freebeekey » 14 Sep 2013 23:03

Updated two computers using update manager, one all good but the second I can't boot into x with new kernel but still works fine with old kernels. Both systems running NVIDIA drivers that DDM installed. I found firefox would not start on both also, so did manual install in opt.

User avatar
GeneC
Posts: 747
Joined: 12 Feb 2013 17:49
Location: Woods of Maine

Re: UP 2013.09.06 06:00 UTC [PRODUCTION]

Postby GeneC » 14 Sep 2013 23:16

freebeekey wrote:Updated two computers using update manager, one all good but the second I can't boot into x with new kernel but still works fine with old kernels. Both systems running NVIDIA drivers that DDM installed. I found firefox would not start on both also, so did manual install in opt.
I found that on one installation as well. I had to re-install Nvidia with DDM with new 3.10 kernel, Nvidia DKMS did not work there.

NOTE: This was a brand new virgin installation of SolydX64 (latest iso). Nvidia installed with DDM on 3.9 kernel.
GeneC

Debian (Testing)
Siduction (Debian SID)

User avatar
freebeekey
Posts: 86
Joined: 22 Jul 2013 02:03
Location: In your Dreams

Re: UP 2013.09.06 06:00 UTC [PRODUCTION]

Postby freebeekey » 15 Sep 2013 01:02

Thanks GeneC and glad I wasn't the only one. I can't run DDM outside of x and when I run it from another kernel isn't it just installing to the running kernel? Thanks to those who are doing all the hard work here on Solyd I do love the system even if there is a hiccup once in a while.

User avatar
Orbmiser
Posts: 829
Joined: 24 Aug 2013 22:58
Location: Portland,Oregon

Re: UP 2013.09.06 06:00 UTC [PRODUCTION]

Postby Orbmiser » 15 Sep 2013 03:51

Problem free update - 535 packages taking 454mb download for SolydK 64bit.
Took 2 hrs on my 1.5mb connection - Then Post applying changes took another 25mins.
Failed twice retrieving packages Thunderbird & Vlc-data.
But just refreshed and tired again. Eventually retrieved them.
One dialog during post about a network config and just slected keep orig. config.

Tested all the apps all loaded no issues so far.

So went smoothly and I did it Right! What do I win? :P
I Want Some Popcorn! :geek:

But my Thanks! Goes out to the Solydee Team! Way to Go! :mrgreen:
.
Portfolio
http://500px.com/Orbmiser
Flickr
http://www.flickr.com/photos/orb9220/

SolydK - Kernel 3.16-2-amd64 - KDE 4.14.1 Update Pack: 2014.10.15

dirigible
Posts: 150
Joined: 16 Mar 2013 03:19

Re: UP 2013.09.06 06:00 UTC [PRODUCTION]

Postby dirigible » 15 Sep 2013 03:58

Is AUS Internode ready to use?
It's my fastest mirror.
SolydK 64bit Home Edition.

User avatar
Arjen Balfoort
Site Admin
Posts: 9396
Joined: 26 Jan 2013 19:36
Location: Netherlands
Contact:

Re: UP 2013.09.06 06:00 UTC [PRODUCTION]

Postby Arjen Balfoort » 15 Sep 2013 06:00

dirigible wrote:Is AUS Internode ready to use?
It's my fastest mirror.
I'm afraid not!
They're still not synchronized, and I don't get a response from my e-mail.


SolydXK needs you!
Development | Testing | Translations

User avatar
ScottQuier
Posts: 1781
Joined: 18 Jul 2013 15:55
Location: Newport News, VA

Re: UP 2013.09.06 06:00 UTC [PRODUCTION]

Postby ScottQuier » 15 Sep 2013 12:53

freebeekey wrote:Thanks GeneC and glad I wasn't the only one. I can't run DDM outside of x and when I run it from another kernel isn't it just installing to the running kernel? Thanks to those who are doing all the hard work here on Solyd I do love the system even if there is a hiccup once in a while.
If you're still having issues with getting Nvidia installed, this is a command that has always worked for me:

Code: Select all

sudo apt-get install nvidia-kernel-dkms nvidia-glx build-essential nvidia-settings nvidia-xconfig
As you already have the nvidia (partiall) installed, this might be a better choice

Code: Select all

sudo apt-get install --reinstall nvidia-kernel-dkms nvidia-glx build-essential nvidia-settings nvidia-xconfig
And, I've seen zerozero recommend the simplier

Code: Select all

sudo apt-get install --reinstall nvidia-kernel-dkms
Scott
Quoting zerozero, "The usage of PPA's in debian-based
systems is risky at best and entails serious compatibility
problems; usually it's the best way to destroy an install"

User avatar
MAYBL8
Posts: 1487
Joined: 10 Mar 2013 18:41
Location: Maryland Heights, MO USA
Contact:

Re: UP 2013.09.06 06:00 UTC [PRODUCTION]

Postby MAYBL8 » 15 Sep 2013 14:42

I have a system that the update manager says updates are available and shows updates listed. When I go install them it acts like it is going to do it and them comes back and says update is complete refreshes itself and then shows the same updates to be installed.
Nothing seems to be installed.

Code: Select all

dcihon@solydk32-package-build ~ $ inxi -r
Repos:     Active apt sources in file: /etc/apt/sources.list
           deb http://packages.solydxk.com/ solydxk main upstream import kdenext community experimental
           deb http://debian.solydxk.com/production testing main contrib non-free
           deb http://debian.solydxk.com/production/multimedia testing main non-free
           deb http://debian.solydxk.com/security testing/updates main contrib non-free
           Active apt sources in file: /etc/apt/sources.list.d/google-chrome.list
           deb http://dl.google.com/linux/chrome/deb/ stable main
dcihon@solydk32-package-build ~ $ 
I just noticed experimental is listed above. I don't remember doing that. This is suppose to be just a production laptop.
Could that be the problem?


toothandnail
Posts: 94
Joined: 02 Jun 2013 18:45
Location: Oxfordshire, UK

Re: UP 2013.09.06 06:00 UTC [PRODUCTION]

Postby toothandnail » 15 Sep 2013 15:29

Just ran the update on my desktop (HP dc7900, SolydX), using the update manager. UM updated itself, then reloaded all the changes and started the UP. After a few seconds it simply disappeared. I restarted it from the menu (the icon didn't come back to the status bar). This time it went through without further drama, and all looks ok.

I've got a couple of non-standard things installed - localepurge and rootkit hunter (had a few problems a while ago and wanted to watch the machine for a while). I noticed Rootkit Hunter coming up on the update manager status bar several times, so whether that upset things or not, I don't know.

After a reboot to the new kernel, I notice the memory footprint is a bit smaller (though that may simply be due to the restart - it looks as though I have something that leaks memory - the machine had around 36 days uptime when I ran the update, and had been showing more and more memory use over the last 15 - 20 days).

So far, looks good....

Paul.

User avatar
Arjen Balfoort
Site Admin
Posts: 9396
Joined: 26 Jan 2013 19:36
Location: Netherlands
Contact:

Re: UP 2013.09.06 06:00 UTC [PRODUCTION]

Postby Arjen Balfoort » 15 Sep 2013 15:35

MAYBL8 wrote:I just noticed experimental is listed above. I don't remember doing that. This is suppose to be just a production laptop.
Could that be the problem?
Not really. You can safely remove it, and run these commands:

Code: Select all

sudo apt-get update
sudo apt-get install --reinstall updatemanager
Quit updatemanager from the tray, restart it, and see if you can update now.


SolydXK needs you!
Development | Testing | Translations

User avatar
MAYBL8
Posts: 1487
Joined: 10 Mar 2013 18:41
Location: Maryland Heights, MO USA
Contact:

Re: UP 2013.09.06 06:00 UTC [PRODUCTION]

Postby MAYBL8 » 15 Sep 2013 16:32

Sorry that didn't work.


User avatar
zerozero
Posts: 5373
Joined: 10 Feb 2013 23:37
Location: West Midlands, England
Contact:

Re: UP 2013.09.06 06:00 UTC [PRODUCTION]

Postby zerozero » 15 Sep 2013 18:20

MAYBL8 wrote:I have a system that the update manager says updates are available and shows updates listed. When I go install them it acts like it is going to do it and them comes back and says update is complete refreshes itself and then shows the same updates to be installed.
Nothing seems to be installed.

Code: Select all

dcihon@solydk32-package-build ~ $ inxi -r
Repos:     Active apt sources in file: /etc/apt/sources.list
           deb http://packages.solydxk.com/ solydxk main upstream import kdenext community experimental
           deb http://debian.solydxk.com/production testing main contrib non-free
           deb http://debian.solydxk.com/production/multimedia testing main non-free
           deb http://debian.solydxk.com/security testing/updates main contrib non-free
           Active apt sources in file: /etc/apt/sources.list.d/google-chrome.list
           deb http://dl.google.com/linux/chrome/deb/ stable main
dcihon@solydk32-package-build ~ $ 
I just noticed experimental is listed above. I don't remember doing that. This is suppose to be just a production laptop.
Could that be the problem?
[highlighted the part that i want to focus now]
do you see the packages/lib that are proposed to update? when you validate the update do you have an extra screen with additional actions (removals and/or new packages to install?)

====
anyway what's the output of

Code: Select all

apt update && apt dist-upgrade
bliss of ignorance

User avatar
freebeekey
Posts: 86
Joined: 22 Jul 2013 02:03
Location: In your Dreams

Re: UP 2013.09.06 06:00 UTC [PRODUCTION]

Postby freebeekey » 15 Sep 2013 18:36

So I tried to reinsall the 3.10 kernel and noticed this (Consult /var/lib/dkms/nvidia/313.30/build/make.log for more information.) So here is the make log:

Code: Select all

DKMS make.log for nvidia-313.30 for kernel 3.10-2-amd64 (x86_64)
Sun Sep 15 10:38:05 PDT 2013
make: Entering directory `/var/lib/dkms/nvidia/313.30/build'
make -C /lib/modules/3.10-2-amd64/build  M=`/bin/pwd` modules
make[1]: Entering directory `/usr/src/linux-headers-3.10-2-amd64'
  CC [M]  /var/lib/dkms/nvidia/313.30/build/nv.o
In file included from /usr/src/linux-headers-3.10-2-common/include/linux/kernel.h:10:0,
                 from /usr/src/linux-headers-3.10-2-common/include/linux/sched.h:15,
                 from /usr/src/linux-headers-3.10-2-common/include/linux/utsname.h:5,
                 from /var/lib/dkms/nvidia/313.30/build/nv-linux.h:46,
                 from /var/lib/dkms/nvidia/313.30/build/nv.c:13:
/usr/src/linux-headers-3.10-2-common/include/linux/bitops.h: In function 'hweight_long':
/usr/src/linux-headers-3.10-2-common/include/linux/bitops.h:66:41: warning: signed and unsigned type in conditional expression [-Wsign-compare]
In file included from /usr/src/linux-headers-3.10-2-common/arch/x86/include/asm/cpumask.h:4:0,
                 from /usr/src/linux-headers-3.10-2-common/arch/x86/include/asm/msr.h:10,
                 from /usr/src/linux-headers-3.10-2-common/arch/x86/include/asm/processor.h:20,
                 from /usr/src/linux-headers-3.10-2-common/arch/x86/include/asm/thread_info.h:22,
                 from /usr/src/linux-headers-3.10-2-common/include/linux/thread_info.h:54,
                 from /usr/src/linux-headers-3.10-2-common/include/linux/preempt.h:9,
                 from /usr/src/linux-headers-3.10-2-common/include/linux/spinlock.h:50,
                 from /usr/src/linux-headers-3.10-2-common/include/linux/seqlock.h:29,
                 from /usr/src/linux-headers-3.10-2-common/include/linux/time.h:5,
                 from /usr/src/linux-headers-3.10-2-common/include/uapi/linux/timex.h:56,
                 from /usr/src/linux-headers-3.10-2-common/include/linux/timex.h:56,
                 from /usr/src/linux-headers-3.10-2-common/include/linux/sched.h:17,
                 from /usr/src/linux-headers-3.10-2-common/include/linux/utsname.h:5,
                 from /var/lib/dkms/nvidia/313.30/build/nv-linux.h:46,
                 from /var/lib/dkms/nvidia/313.30/build/nv.c:13:
/usr/src/linux-headers-3.10-2-common/include/linux/cpumask.h: In function 'cpumask_parse':
/usr/src/linux-headers-3.10-2-common/include/linux/cpumask.h:603:26: warning: signed and unsigned type in conditional expression [-Wsign-compare]
In file included from /usr/src/linux-headers-3.10-2-common/arch/x86/include/asm/uaccess.h:539:0,
                 from /usr/src/linux-headers-3.10-2-common/include/linux/poll.h:11,
                 from /var/lib/dkms/nvidia/313.30/build/nv-linux.h:117,
                 from /var/lib/dkms/nvidia/313.30/build/nv.c:13:
/usr/src/linux-headers-3.10-2-common/arch/x86/include/asm/uaccess_64.h: In function 'copy_from_user':
/usr/src/linux-headers-3.10-2-common/arch/x86/include/asm/uaccess_64.h:62:6: warning: comparison between signed and unsigned integer expressions [-Wsign-compare]
  CC [M]  /var/lib/dkms/nvidia/313.30/build/nv-acpi.o
In file included from /usr/src/linux-headers-3.10-2-common/include/linux/kernel.h:10:0,
                 from /usr/src/linux-headers-3.10-2-common/include/linux/sched.h:15,
                 from /usr/src/linux-headers-3.10-2-common/include/linux/utsname.h:5,
                 from /var/lib/dkms/nvidia/313.30/build/nv-linux.h:46,
                 from /var/lib/dkms/nvidia/313.30/build/nv-acpi.c:15:
/usr/src/linux-headers-3.10-2-common/include/linux/bitops.h: In function 'hweight_long':
/usr/src/linux-headers-3.10-2-common/include/linux/bitops.h:66:41: warning: signed and unsigned type in conditional expression [-Wsign-compare]
In file included from /usr/src/linux-headers-3.10-2-common/arch/x86/include/asm/cpumask.h:4:0,
                 from /usr/src/linux-headers-3.10-2-common/arch/x86/include/asm/msr.h:10,
                 from /usr/src/linux-headers-3.10-2-common/arch/x86/include/asm/processor.h:20,
                 from /usr/src/linux-headers-3.10-2-common/arch/x86/include/asm/thread_info.h:22,
                 from /usr/src/linux-headers-3.10-2-common/include/linux/thread_info.h:54,
                 from /usr/src/linux-headers-3.10-2-common/include/linux/preempt.h:9,
                 from /usr/src/linux-headers-3.10-2-common/include/linux/spinlock.h:50,
                 from /usr/src/linux-headers-3.10-2-common/include/linux/seqlock.h:29,
                 from /usr/src/linux-headers-3.10-2-common/include/linux/time.h:5,
                 from /usr/src/linux-headers-3.10-2-common/include/uapi/linux/timex.h:56,
                 from /usr/src/linux-headers-3.10-2-common/include/linux/timex.h:56,
                 from /usr/src/linux-headers-3.10-2-common/include/linux/sched.h:17,
                 from /usr/src/linux-headers-3.10-2-common/include/linux/utsname.h:5,
                 from /var/lib/dkms/nvidia/313.30/build/nv-linux.h:46,
                 from /var/lib/dkms/nvidia/313.30/build/nv-acpi.c:15:
/usr/src/linux-headers-3.10-2-common/include/linux/cpumask.h: In function 'cpumask_parse':
/usr/src/linux-headers-3.10-2-common/include/linux/cpumask.h:603:26: warning: signed and unsigned type in conditional expression [-Wsign-compare]
In file included from /usr/src/linux-headers-3.10-2-common/arch/x86/include/asm/uaccess.h:539:0,
                 from /usr/src/linux-headers-3.10-2-common/include/linux/poll.h:11,
                 from /var/lib/dkms/nvidia/313.30/build/nv-linux.h:117,
                 from /var/lib/dkms/nvidia/313.30/build/nv-acpi.c:15:
/usr/src/linux-headers-3.10-2-common/arch/x86/include/asm/uaccess_64.h: In function 'copy_from_user':
/usr/src/linux-headers-3.10-2-common/arch/x86/include/asm/uaccess_64.h:62:6: warning: comparison between signed and unsigned integer expressions [-Wsign-compare]
/var/lib/dkms/nvidia/313.30/build/nv-acpi.c: At top level:
/var/lib/dkms/nvidia/313.30/build/nv-acpi.c:70:9: warning: initialization from incompatible pointer type [enabled by default]
/var/lib/dkms/nvidia/313.30/build/nv-acpi.c:70:9: warning: (near initialization for 'nv_acpi_driver_template.ops.remove') [enabled by default]
  CC [M]  /var/lib/dkms/nvidia/313.30/build/nv-chrdev.o
In file included from /usr/src/linux-headers-3.10-2-common/include/linux/kernel.h:10:0,
                 from /usr/src/linux-headers-3.10-2-common/include/linux/sched.h:15,
                 from /usr/src/linux-headers-3.10-2-common/include/linux/utsname.h:5,
                 from /var/lib/dkms/nvidia/313.30/build/nv-linux.h:46,
                 from /var/lib/dkms/nvidia/313.30/build/nv-chrdev.c:15:
/usr/src/linux-headers-3.10-2-common/include/linux/bitops.h: In function 'hweight_long':
/usr/src/linux-headers-3.10-2-common/include/linux/bitops.h:66:41: warning: signed and unsigned type in conditional expression [-Wsign-compare]
In file included from /usr/src/linux-headers-3.10-2-common/arch/x86/include/asm/cpumask.h:4:0,
                 from /usr/src/linux-headers-3.10-2-common/arch/x86/include/asm/msr.h:10,
                 from /usr/src/linux-headers-3.10-2-common/arch/x86/include/asm/processor.h:20,
                 from /usr/src/linux-headers-3.10-2-common/arch/x86/include/asm/thread_info.h:22,
                 from /usr/src/linux-headers-3.10-2-common/include/linux/thread_info.h:54,
                 from /usr/src/linux-headers-3.10-2-common/include/linux/preempt.h:9,
                 from /usr/src/linux-headers-3.10-2-common/include/linux/spinlock.h:50,
                 from /usr/src/linux-headers-3.10-2-common/include/linux/seqlock.h:29,
                 from /usr/src/linux-headers-3.10-2-common/include/linux/time.h:5,
                 from /usr/src/linux-headers-3.10-2-common/include/uapi/linux/timex.h:56,
                 from /usr/src/linux-headers-3.10-2-common/include/linux/timex.h:56,
                 from /usr/src/linux-headers-3.10-2-common/include/linux/sched.h:17,
                 from /usr/src/linux-headers-3.10-2-common/include/linux/utsname.h:5,
                 from /var/lib/dkms/nvidia/313.30/build/nv-linux.h:46,
                 from /var/lib/dkms/nvidia/313.30/build/nv-chrdev.c:15:
/usr/src/linux-headers-3.10-2-common/include/linux/cpumask.h: In function 'cpumask_parse':
/usr/src/linux-headers-3.10-2-common/include/linux/cpumask.h:603:26: warning: signed and unsigned type in conditional expression [-Wsign-compare]
In file included from /usr/src/linux-headers-3.10-2-common/arch/x86/include/asm/uaccess.h:539:0,
                 from /usr/src/linux-headers-3.10-2-common/include/linux/poll.h:11,
                 from /var/lib/dkms/nvidia/313.30/build/nv-linux.h:117,
                 from /var/lib/dkms/nvidia/313.30/build/nv-chrdev.c:15:
/usr/src/linux-headers-3.10-2-common/arch/x86/include/asm/uaccess_64.h: In function 'copy_from_user':
/usr/src/linux-headers-3.10-2-common/arch/x86/include/asm/uaccess_64.h:62:6: warning: comparison between signed and unsigned integer expressions [-Wsign-compare]
  CC [M]  /var/lib/dkms/nvidia/313.30/build/nv-cray.o
In file included from /usr/src/linux-headers-3.10-2-common/include/linux/kernel.h:10:0,
                 from /usr/src/linux-headers-3.10-2-common/include/linux/sched.h:15,
                 from /usr/src/linux-headers-3.10-2-common/include/linux/utsname.h:5,
                 from /var/lib/dkms/nvidia/313.30/build/nv-linux.h:46,
                 from /var/lib/dkms/nvidia/313.30/build/nv-cray.c:15:
/usr/src/linux-headers-3.10-2-common/include/linux/bitops.h: In function 'hweight_long':
/usr/src/linux-headers-3.10-2-common/include/linux/bitops.h:66:41: warning: signed and unsigned type in conditional expression [-Wsign-compare]
In file included from /usr/src/linux-headers-3.10-2-common/arch/x86/include/asm/cpumask.h:4:0,
                 from /usr/src/linux-headers-3.10-2-common/arch/x86/include/asm/msr.h:10,
                 from /usr/src/linux-headers-3.10-2-common/arch/x86/include/asm/processor.h:20,
                 from /usr/src/linux-headers-3.10-2-common/arch/x86/include/asm/thread_info.h:22,
                 from /usr/src/linux-headers-3.10-2-common/include/linux/thread_info.h:54,
                 from /usr/src/linux-headers-3.10-2-common/include/linux/preempt.h:9,
                 from /usr/src/linux-headers-3.10-2-common/include/linux/spinlock.h:50,
                 from /usr/src/linux-headers-3.10-2-common/include/linux/seqlock.h:29,
                 from /usr/src/linux-headers-3.10-2-common/include/linux/time.h:5,
                 from /usr/src/linux-headers-3.10-2-common/include/uapi/linux/timex.h:56,
                 from /usr/src/linux-headers-3.10-2-common/include/linux/timex.h:56,
                 from /usr/src/linux-headers-3.10-2-common/include/linux/sched.h:17,
                 from /usr/src/linux-headers-3.10-2-common/include/linux/utsname.h:5,
                 from /var/lib/dkms/nvidia/313.30/build/nv-linux.h:46,
                 from /var/lib/dkms/nvidia/313.30/build/nv-cray.c:15:
/usr/src/linux-headers-3.10-2-common/include/linux/cpumask.h: In function 'cpumask_parse':
/usr/src/linux-headers-3.10-2-common/include/linux/cpumask.h:603:26: warning: signed and unsigned type in conditional expression [-Wsign-compare]
In file included from /usr/src/linux-headers-3.10-2-common/arch/x86/include/asm/uaccess.h:539:0,
                 from /usr/src/linux-headers-3.10-2-common/include/linux/poll.h:11,
                 from /var/lib/dkms/nvidia/313.30/build/nv-linux.h:117,
                 from /var/lib/dkms/nvidia/313.30/build/nv-cray.c:15:
/usr/src/linux-headers-3.10-2-common/arch/x86/include/asm/uaccess_64.h: In function 'copy_from_user':
/usr/src/linux-headers-3.10-2-common/arch/x86/include/asm/uaccess_64.h:62:6: warning: comparison between signed and unsigned integer expressions [-Wsign-compare]
  CC [M]  /var/lib/dkms/nvidia/313.30/build/nv-gvi.o
In file included from /usr/src/linux-headers-3.10-2-common/include/linux/kernel.h:10:0,
                 from /usr/src/linux-headers-3.10-2-common/include/linux/sched.h:15,
                 from /usr/src/linux-headers-3.10-2-common/include/linux/utsname.h:5,
                 from /var/lib/dkms/nvidia/313.30/build/nv-linux.h:46,
                 from /var/lib/dkms/nvidia/313.30/build/nv-gvi.c:15:
/usr/src/linux-headers-3.10-2-common/include/linux/bitops.h: In function 'hweight_long':
/usr/src/linux-headers-3.10-2-common/include/linux/bitops.h:66:41: warning: signed and unsigned type in conditional expression [-Wsign-compare]
In file included from /usr/src/linux-headers-3.10-2-common/arch/x86/include/asm/cpumask.h:4:0,
                 from /usr/src/linux-headers-3.10-2-common/arch/x86/include/asm/msr.h:10,
                 from /usr/src/linux-headers-3.10-2-common/arch/x86/include/asm/processor.h:20,
                 from /usr/src/linux-headers-3.10-2-common/arch/x86/include/asm/thread_info.h:22,
                 from /usr/src/linux-headers-3.10-2-common/include/linux/thread_info.h:54,
                 from /usr/src/linux-headers-3.10-2-common/include/linux/preempt.h:9,
                 from /usr/src/linux-headers-3.10-2-common/include/linux/spinlock.h:50,
                 from /usr/src/linux-headers-3.10-2-common/include/linux/seqlock.h:29,
                 from /usr/src/linux-headers-3.10-2-common/include/linux/time.h:5,
                 from /usr/src/linux-headers-3.10-2-common/include/uapi/linux/timex.h:56,
                 from /usr/src/linux-headers-3.10-2-common/include/linux/timex.h:56,
                 from /usr/src/linux-headers-3.10-2-common/include/linux/sched.h:17,
                 from /usr/src/linux-headers-3.10-2-common/include/linux/utsname.h:5,
                 from /var/lib/dkms/nvidia/313.30/build/nv-linux.h:46,
                 from /var/lib/dkms/nvidia/313.30/build/nv-gvi.c:15:
/usr/src/linux-headers-3.10-2-common/include/linux/cpumask.h: In function 'cpumask_parse':
/usr/src/linux-headers-3.10-2-common/include/linux/cpumask.h:603:26: warning: signed and unsigned type in conditional expression [-Wsign-compare]
In file included from /usr/src/linux-headers-3.10-2-common/arch/x86/include/asm/uaccess.h:539:0,
                 from /usr/src/linux-headers-3.10-2-common/include/linux/poll.h:11,
                 from /var/lib/dkms/nvidia/313.30/build/nv-linux.h:117,
                 from /var/lib/dkms/nvidia/313.30/build/nv-gvi.c:15:
/usr/src/linux-headers-3.10-2-common/arch/x86/include/asm/uaccess_64.h: In function 'copy_from_user':
/usr/src/linux-headers-3.10-2-common/arch/x86/include/asm/uaccess_64.h:62:6: warning: comparison between signed and unsigned integer expressions [-Wsign-compare]
  CC [M]  /var/lib/dkms/nvidia/313.30/build/nv-i2c.o
In file included from /usr/src/linux-headers-3.10-2-common/include/linux/kernel.h:10:0,
                 from /usr/src/linux-headers-3.10-2-common/include/linux/sched.h:15,
                 from /usr/src/linux-headers-3.10-2-common/include/linux/utsname.h:5,
                 from /var/lib/dkms/nvidia/313.30/build/nv-linux.h:46,
                 from /var/lib/dkms/nvidia/313.30/build/nv-i2c.c:15:
/usr/src/linux-headers-3.10-2-common/include/linux/bitops.h: In function 'hweight_long':
/usr/src/linux-headers-3.10-2-common/include/linux/bitops.h:66:41: warning: signed and unsigned type in conditional expression [-Wsign-compare]
In file included from /usr/src/linux-headers-3.10-2-common/arch/x86/include/asm/cpumask.h:4:0,
                 from /usr/src/linux-headers-3.10-2-common/arch/x86/include/asm/msr.h:10,
                 from /usr/src/linux-headers-3.10-2-common/arch/x86/include/asm/processor.h:20,
                 from /usr/src/linux-headers-3.10-2-common/arch/x86/include/asm/thread_info.h:22,
                 from /usr/src/linux-headers-3.10-2-common/include/linux/thread_info.h:54,
                 from /usr/src/linux-headers-3.10-2-common/include/linux/preempt.h:9,
                 from /usr/src/linux-headers-3.10-2-common/include/linux/spinlock.h:50,
                 from /usr/src/linux-headers-3.10-2-common/include/linux/seqlock.h:29,
                 from /usr/src/linux-headers-3.10-2-common/include/linux/time.h:5,
                 from /usr/src/linux-headers-3.10-2-common/include/uapi/linux/timex.h:56,
                 from /usr/src/linux-headers-3.10-2-common/include/linux/timex.h:56,
                 from /usr/src/linux-headers-3.10-2-common/include/linux/sched.h:17,
                 from /usr/src/linux-headers-3.10-2-common/include/linux/utsname.h:5,
                 from /var/lib/dkms/nvidia/313.30/build/nv-linux.h:46,
                 from /var/lib/dkms/nvidia/313.30/build/nv-i2c.c:15:
/usr/src/linux-headers-3.10-2-common/include/linux/cpumask.h: In function 'cpumask_parse':
/usr/src/linux-headers-3.10-2-common/include/linux/cpumask.h:603:26: warning: signed and unsigned type in conditional expression [-Wsign-compare]
In file included from /usr/src/linux-headers-3.10-2-common/arch/x86/include/asm/uaccess.h:539:0,
                 from /usr/src/linux-headers-3.10-2-common/include/linux/poll.h:11,
                 from /var/lib/dkms/nvidia/313.30/build/nv-linux.h:117,
                 from /var/lib/dkms/nvidia/313.30/build/nv-i2c.c:15:
/usr/src/linux-headers-3.10-2-common/arch/x86/include/asm/uaccess_64.h: In function 'copy_from_user':
/usr/src/linux-headers-3.10-2-common/arch/x86/include/asm/uaccess_64.h:62:6: warning: comparison between signed and unsigned integer expressions [-Wsign-compare]
/var/lib/dkms/nvidia/313.30/build/nv-i2c.c: In function 'nv_i2c_del_adapter':
/var/lib/dkms/nvidia/313.30/build/nv-i2c.c:327:14: error: void value not ignored as it ought to be
make[4]: *** [/var/lib/dkms/nvidia/313.30/build/nv-i2c.o] Error 1
make[3]: *** [_module_/var/lib/dkms/nvidia/313.30/build] Error 2
make[2]: *** [sub-make] Error 2
make[1]: *** [all] Error 2
make[1]: Leaving directory `/usr/src/linux-headers-3.10-2-amd64'
make: *** [modules] Error 2
make: Leaving directory `/var/lib/dkms/nvidia/313.30/build'
Too much for me to understand but maybe someone else can make something of it. As I said before I am running previous kernels with out a problem so really not a big deal.

User avatar
MAYBL8
Posts: 1487
Joined: 10 Mar 2013 18:41
Location: Maryland Heights, MO USA
Contact:

Re: UP 2013.09.06 06:00 UTC [PRODUCTION]

Postby MAYBL8 » 15 Sep 2013 18:40

Code: Select all

ACihon@solydk32-package-build ~ $ sudo apt update && sudo apt dist-upgrade
[sudo] password for ACihon: 
Ign http://dl.google.com stable InRelease
Get:1 http://packages.solydxk.com solydxk InRelease [24.5 kB]
Hit http://dl.google.com stable Release.gpg                                
Hit http://dl.google.com stable Release                                    
Hit http://dl.google.com stable/main i386 Packages                     
Hit http://packages.solydxk.com solydxk/main i386 Packages
Hit http://packages.solydxk.com solydxk/upstream i386 Packages
Get:2 http://debian.solydxk.com testing InRelease [148 kB]
Hit http://packages.solydxk.com solydxk/import i386 Packages               
Hit http://packages.solydxk.com solydxk/kdenext i386 Packages              
Hit http://packages.solydxk.com solydxk.nlmunity i386 Packages            
Hit http://packages.solydxk.com solydxk/experimental i386 Packages         
Ign http://dl.google.com stable/main Translation-en_US                     
Ign http://dl.google.com stable/main Translation-en                        
Ign http://debian.solydxk.com testing InRelease      
Get:3 http://debian.solydxk.com testing/updates InRelease [78.7 kB]
Hit http://debian.solydxk.com testing/main i386 Packages/DiffIndex
Hit http://debian.solydxk.com testing/contrib i386 Packages/DiffIndex
Hit http://debian.solydxk.com testing/non-free i386 Packages/DiffIndex
Hit http://debian.solydxk.com testing/contrib Translation-en/DiffIndex
Hit http://debian.solydxk.com testing/main Translation-en/DiffIndex
Hit http://debian.solydxk.com testing/non-free Translation-en/DiffIndex
Hit http://debian.solydxk.com testing Release.gpg
Hit http://debian.solydxk.com testing/updates/main i386 Packages
Hit http://debian.solydxk.com testing/updates/contrib i386 Packages
Hit http://debian.solydxk.com testing/updates/non-free i386 Packages
Hit http://debian.solydxk.com testing/updates/contrib Translation-en
Hit http://debian.solydxk.com testing/updates/main Translation-en
Hit http://debian.solydxk.com testing/updates/non-free Translation-en
Hit http://debian.solydxk.com testing Release   
Hit http://debian.solydxk.com testing/main i386 Packages
Hit http://debian.solydxk.com testing/non-free i386 Packages
Ign http://debian.solydxk.com testing/main Translation-en_US
Ign http://packages.solydxk.com solydxk.nlmunity Translation-en_US
Ign http://packages.solydxk.com solydxk.nlmunity Translation-en
Ign http://debian.solydxk.com testing/main Translation-en
Ign http://packages.solydxk.com solydxk/experimental Translation-en_US
Ign http://debian.solydxk.com testing/non-free Translation-en_US
Ign http://packages.solydxk.com solydxk/experimental Translation-en
Ign http://debian.solydxk.com testing/non-free Translation-en
Ign http://packages.solydxk.com solydxk/import Translation-en_US
Ign http://packages.solydxk.com solydxk/import Translation-en
Ign http://packages.solydxk.com solydxk/kdenext Translation-en_US
Ign http://packages.solydxk.com solydxk/kdenext Translation-en
Ign http://packages.solydxk.com solydxk/main Translation-en_US                                                                                    
Ign http://packages.solydxk.com solydxk/main Translation-en                                                                                       
Ign http://packages.solydxk.com solydxk/upstream Translation-en_US                                                                                
Ign http://packages.solydxk.com solydxk/upstream Translation-en                                                                                   
Fetched 252 kB in 6s (39.1 kB/s)                                                                                                                  
Reading package lists... Done
Reading package lists... Done
Building dependency tree       
Reading state information... Done
Calculating upgrade... Done
The following packages will be REMOVED:
  libtaskmanager4abi3
The following NEW packages will be installed:
  dh-python digikam-private-libs freerdp-x11 gstreamer1.0-plugins-base gstreamer1.0-plugins-good gstreamer1.0-x libakonadi-calendar4
  libboost-program-options1.54.0 libclucene-core1 libdvbpsi9 libebml4 libfreerdp-plugins-standard libfreerdp1 libgtkglext1 libharfbuzz-icu0
  libjs-mootools libkdcraw22 libkdecorations4abi50 libkipi11 libkqoauth0 libkwineffects1abi50 libkwinglutils1abi50 libmarblewidget16 libmatroska6
  libnepomukcleaner4 libokularcore3 libopencv-calib3d2.4 libopencv-contrib2.4 libopencv-core2.4 libopencv-features2d2.4 libopencv-flann2.4
  libopencv-highgui2.4 libopencv-imgproc2.4 libopencv-legacy2.4 libopencv-ml2.4 libopencv-objdetect2.4 libopencv-photo2.4 libopencv-video2.4
  libpgf6 libplasmaclock4abi50 libpulsedsp libpython3-stdlib libqextserialport1 libqpdf13 libsbc1 libsqlite0 libtaskmanager4abi50 libwebp4
  libxcb-image0 libxcb-sync0 libxcb-xtest0 libxtables10 linux-headers-3.10-2-486 linux-headers-3.10-2-686-pae linux-headers-3.10-2-common
  linux-image-3.10-2-486 linux-image-3.10-2-686-pae linux-kbuild-3.10 python3-aptdaemon python3-dbus python3-defer python3-gi
  python3-pkg-resources
The following packages will be upgraded:
  akonadi-backend-mysql akonadi-backend-sqlite akonadi-server amarok amarok-common amarok-utils apt apt-utils aptdaemon ark at-spi2-core autoconf
  automake autopkgtest autopoint autotools-dev base-passwd bluez bluez-cups bogofilter bogofilter-bdb bogofilter-common btrfs-tools bzip2
  ca-certificates-java cifs-utils colord console-setup console-setup-linux coreutils cowbuilder cowdancer cups cups-browsed cups-client
  cups-common cups-daemon cups-filters cups-ppdc cups-server-common curl dcraw ddm debhelper debian-keyring debian-plymouth-manager debianutils
  debsums developers-reference devscripts digikam digikam-data dmidecode dnsmasq-base dolphin evolution-data-server-common ffmpeg firefox
  firefox-l10n-en-us firmware-atheros firmware-bnx2 firmware-bnx2x firmware-brcm80211 firmware-intelwimax firmware-ipw2x00 firmware-ivtv
  firmware-iwlwifi firmware-libertas firmware-linux firmware-linux-nonfree firmware-qlogic firmware-ralink firmware-realtek fortune-mod
  fortunes-min freespacenotifier gdebi gdebi-core gdebi-kde geoip-database gettext gettext-base gimp gimp-data git git-man google-chrome-stable
  gpsd grep gwenview gzip hwdata ifupdown init-system-helpers inxi iproute iproute2 iptables iso-codes java-common javascript-common kaddressbook
  kamera kate kate-data katepart kcalc kcharselect kde-baseapps kde-baseapps-bin kde-baseapps-data kde-config-touchpad kde-plasma-desktop
  kde-runtime kde-runtime-data kde-style-oxygen kde-wallpapers-default kde-window-manager kde-workspace kde-workspace-bin kde-workspace-data
  kde-workspace-kgreet-plugins kdebase-runtime kdelibs-bin kdelibs5-data kdelibs5-plugins kdenetwork-filesharing kdepasswd kdepim-runtime
  kdepimlibs-kio-plugins kdf kdm kdoctools keyboard-configuration kfind kget kgpg khelpcenter4 kinfocenter kio-audiocd kipi-plugins
  kipi-plugins-common klipper kmenuedit kmix knotes konqueror konqueror-nsplugins konsole kopete kppp krdc ksaneplugin kscreensaver
  kscreensaver-xsavers ksnapshot ksysguard ksysguardd ksystemlog ktorrent kwalletmanager kwrite libaa1 libakonadi-contact4 libakonadi-kabc4
  libakonadi-kcal4 libakonadi-kde4 libakonadi-kmime4 libakonadiprotocolinternals1 libalgorithm-diff-xs-perl libapt-inst1.5 libapt-pkg4.12
  libasprintf-dev libasprintf0c2 libassuan0 libatk-bridge2.0-0 libatk-wrapper-java libatk-wrapper-java-jni libatspi2.0-0 libaudio2 libavcodec54
  libavdevice54 libavfilter3 libavformat54 libavutil52 libbluetooth3 libboost-date-time1.53.0 libboost-filesystem1.53.0 libboost-regex1.53.0
  libboost-signals1.53.0 libboost-system1.53.0 libboost-thread1.53.0 libbrlapi0.6 libbz2-1.0 libc-bin libc-dev-bin libc6 libc6-dev libc6-i686
  libcdt4 libcln6 libcolord1 libcolorhug1 libcommon-sense-perl libcups2 libcupscgi1 libcupsfilters1 libcupsimage2 libcupsmime1 libcupsppdc1
  libcurl3 libcurl3-gnutls libdistro-info-perl libdrm-dev libdrm-intel1 libdrm-nouveau2 libdrm-radeon1 libdrm2 libegl1-mesa libegl1-mesa-drivers
  libfdk-aac0 libfftw3-3 libfftw3-double3 libfftw3-single3 libfontembed1 libgbm1 libgcrypt11 libgeoip1 libgettextpo-dev libgettextpo0 libgimp2.0
  libgl1-mesa-dev libgl1-mesa-dri libgl1-mesa-glx libglapi-mesa libglib2.0-0 libglib2.0-data libgpgme++2 libgpgme11 libgps20 libgraph4
  libgssdp-1.0-3 libgstreamer-plugins-base1.0-0 libgstreamer1.0-0 libgtk2-perl libgupnp-1.0-4 libgvc5 libharfbuzz0a libio-socket-ssl-perl
  libjavascriptcoregtk-1.0-0 libjavascriptcoregtk-3.0-0 libjs-jquery libkabc4 libkactivities-bin libkactivities-models1 libkactivities6
  libkateinterfaces4 libkatepartinterfaces4 libkcal4 libkcalcore4 libkcalutils4 libkcddb4 libkcmutils4 libkcompactdisc4 libkdcraw-data
  libkde3support4 libkdeclarative5 libkdecore5 libkdepim4 libkdesu5 libkdeui5 libkdewebkit5 libkdnssd4 libkemoticons4 libkephal4abi1 libkexiv2-11
  libkexiv2-data libkfile4 libkholidays4 libkhtml5 libkidletime4 libkimap4 libkimproxy4 libkio5 libkipi-data libkipi10 libkjsapi4 libkjsembed4
  libkldap4 libkleo4 libkmediaplayer4 libkmime4 libkms1 libknewstuff2-4 libknewstuff3-4 libknotifyconfig4 libkntlm4 libkonq-common
  libkonq5-templates libkonq5abi1 libkonqsidebarplugin4a libkontactinterface4 libkopete4 libkparts4 libkpimidentities4 libkpimtextedit4
  libkpimutils4 libkprintutils4 libkpty4 libkresources4 libkrosscore4 libksane-data libksane0 libkscreensaver5 libksgrd4 libksignalplotter4
  libktexteditor4 libkunitconversion4 libkutils4 libkworkspace4abi2 libkxmlrpcclient4 liblognorm0 liblouis-data liblua5.1-0 libmailtransport4
  libmarblewidget15 libmicroblog4 libnepomuk4 libnepomukcore4 libnepomukquery4a libnepomukutils4 libnepomukwidgets4 libnet-ssleay-perl
  libnetfilter-conntrack3 libnewt0.52 libnss-winbind libnss3 libnss3-1d libokularcore2 libopenobex1 libopenvg1-mesa libpam-winbind libpango-perl
  libpathplan4 libpciaccess0 libpcsclite1 libpixman-1-0 libplasma-geolocation-interface4 libplasma3 libplasmagenericshell4 libpoppler-glib8
  libpoppler-qt4-3 libpoppler19 libpostproc52 libprocesscore4abi1 libprocessui4a libpulse-mainloop-glib0 libpulse0 libpython-stdlib libpython3.3
  libpython3.3-minimal libpython3.3-stdlib libqgpgme1 libqt4-dbus libqt4-declarative libqt4-designer libqt4-help libqt4-network libqt4-opengl
  libqt4-qt3support libqt4-script libqt4-scripttools libqt4-sql libqt4-sql-mysql libqt4-sql-sqlite libqt4-svg libqt4-test libqt4-xml
  libqt4-xmlpatterns libqtcore4 libqtdbus4 libqtgui4 librpm3 librpmio3 libsdl-image1.2 libsdl-mixer1.2 libsdl1.2debian libservlet2.5-java
  libsmbclient libsmokebase3 libsmokekdecore4-3 libsmokekdeui4-3 libsmokekfile3 libsmokekhtml3 libsmokekio3 libsmokeknewstuff2-3
  libsmokeknewstuff3-3 libsmokekparts3 libsmokektexteditor3 libsmokekutils3 libsmokenepomuk3 libsmokesolid3 libsnmp-base libsnmp30
  libsoap-lite-perl libsocket-perl libsolid4 libsoprano4 libspandsp2 libsrtp0 libstreamanalyzer0 libstreams0 libswresample0 libswscale2
  libsyndication4 libtalloc2 libtdb1 libtelepathy-qt4-2 libtevent0 libthreadweaver4 libtiff5 libupower-glib1 libusb-1.0-0 libv4l-0 libv4lconvert0
  libvdpau1 libvirtodbc0 libvlc5 libvlccore5 libwbclient0 libweather-ion6 libwebkitgtk-1.0-0 libwebkitgtk-1.0-common libwebkitgtk-3.0-0
  libwebkitgtk-3.0-common libx11-6 libx11-data libx11-dev libx11-xcb-dev libx11-xcb1 libxdot4 libxfont1 libxi6 libxml2 libxml2-utils libxslt1.1
  libxt-dev libxt6 libxtst6 libxv1 libxvmc1 libxxf86dga1 libxxf86vm-dev libxxf86vm1 libzbar0 lintian linux-headers-486 linux-headers-686-pae
  linux-image-486 linux-image-686-pae linux-libc-dev locales manpages manpages-dev marble-data marble-plugins media-player-info mesa-common-dev
  mplayerthumbs multiarch-support ndiswrapper-utils-1.9 nepomuk-core-data nepomuk-core-runtime obexd-client okular os-prober oxygen-icon-theme
  piuparts piuparts-common plasma-dataengines-addons plasma-dataengines-workspace plasma-desktop plasma-netbook plasma-scriptengine-javascript
  plasma-scriptengine-python plasma-scriptengine-superkaramba plasma-widget-folderview plasma-widget-lancelot plasma-widgets-addons
  plasma-widgets-workspace polkit-kde-1 poppler-utils pulseaudio pulseaudio-esound-compat pulseaudio-module-bluetooth pulseaudio-module-gconf
  pulseaudio-module-x11 pulseaudio-module-zeroconf pulseaudio-utils python python-aptdaemon python-brlapi python-crypto python-dbus
  python-distro-info python-feedparser python-gdbm python-httplib2 python-kde4 python-markupsafe python-minimal python-numpy python-opencv
  python-openssl python-pkg-resources python-qt4 python-qt4-dbus python-sip python-zope.interface python3 python3-minimal python3.3
  python3.3-minimal qdbus qpdf qtcore4-l10n rpm-common rpm2cpio rsyslog ruby-kde4 ruby-locale samba samba-common samba-common-bin sed smbclient
  solydxk-softwaremanager solydxk-sws solydxk-system soprano-daemon ssl-cert sudo systemsettings tar tasksel tasksel-data thunderbird
  thunderbird-l10n-en-us tzdata tzdata-java ucf unrar upower user-setup virtuoso-opensource-6.1-bin virtuoso-opensource-6.1-common vlc-data
  vlc-nox vlc-plugin-notify vlc-plugin-pulse w3m whiptail winbind x11-apps x11-utils xserver-xorg-video-fbdev xserver-xorg-video-intel
  xserver-xorg-video-nouveau
568 upgraded, 63 newly installed, 1 to remove and 0 not upgraded.
Need to get 0 B/613 MB of archives.
After this operation, 273 MB of additional disk space will be used.
Do you want to continue [Y/n]? 
       
Should I answer y/n?


User avatar
zerozero
Posts: 5373
Joined: 10 Feb 2013 23:37
Location: West Midlands, England
Contact:

Re: UP 2013.09.06 06:00 UTC [PRODUCTION]

Postby zerozero » 15 Sep 2013 18:47

MAYBL8 wrote:Should I answer y/n?
Dan
that is the all-regular UP, you can safely say "yes"
what i don't understand is
1) why UM doesn't start the installation, specially
2) since all the data is already downloaded
Need to get 0 B/613 MB of archives.
bliss of ignorance


Return to “News & Anouncements”

Who is online

Users browsing this forum: No registered users and 3 guests