La compilation ne fonctionne pas

De façon transitoire, ce forum reste ouvert le temps nécessaire pour les utilisateurs francophones de passer au forum multilingue.
jojo 35
Posts: 98
Joined: 12 Aug 2013 07:39
Location: Région de Rennes

La compilation ne fonctionne pas

Postby jojo 35 » 07 Mar 2015 15:25

Bonjour à tous, ;)

Cherchant à installer un programme, j'ai voulu le compiler.
J'ai un problème, lorsque je fais :

Code: Select all

jojo@jojo:~/Bureau/DPOLinuxSTA_V2600_$ ./configure
bash: ./configure: Aucun fichier ou dossier de ce type
jojo@jojo:~/Bureau/DPOLinuxSTA_V2600_$ make
make -C tools
make[1]: Entering directory '/home/jojo/Bureau/DPOLinuxSTA_V2600_/tools'
gcc -g bin2h.c -o bin2h
make[1]: Leaving directory '/home/jojo/Bureau/DPOLinuxSTA_V2600_/tools'
/home/jojo/Bureau/DPOLinuxSTA_V2600_/tools/bin2h
cp -f os/linux/Makefile.6 /home/jojo/Bureau/DPOLinuxSTA_V2600_/os/linux/Makefile
make -C /lib/modules/3.16.0-4-amd64/build SUBDIRS=/home/jojo/Bureau/DPOLinuxSTA_V2600_/os/linux modules
make[1]: Entering directory '/usr/src/linux-headers-3.16.0-4-amd64'
Makefile:10: *** mixed implicit and normal rules: deprecated syntax
make[1]: Entering directory `/usr/src/linux-headers-3.16.0-4-amd64'
  CC [M]  /home/jojo/Bureau/DPOLinuxSTA_V2600_/os/linux/../../common/crypt_md5.o
  CC [M]  /home/jojo/Bureau/DPOLinuxSTA_V2600_/os/linux/../../common/crypt_sha2.o
  CC [M]  /home/jojo/Bureau/DPOLinuxSTA_V2600_/os/linux/../../common/crypt_hmac.o
  CC [M]  /home/jojo/Bureau/DPOLinuxSTA_V2600_/os/linux/../../common/crypt_aes.o
/home/jojo/Bureau/DPOLinuxSTA_V2600_/os/linux/../../common/crypt_aes.c: In function ‘AES_Key_Wrap’:
/home/jojo/Bureau/DPOLinuxSTA_V2600_/os/linux/../../common/crypt_aes.c:1466:6: warning: format ‘%d’ expects argument of type ‘int’, but argument 2 has type ‘long unsigned int’ [-Wformat=]
      DBGPRINT(RT_DEBUG_ERROR, ("AES_Key_Wrap: allocate %d bytes memory failure.\n", sizeof(UINT8)*PlainTextLength));
      ^
/home/jojo/Bureau/DPOLinuxSTA_V2600_/os/linux/../../common/crypt_aes.c: In function ‘AES_Key_Unwrap’:
/home/jojo/Bureau/DPOLinuxSTA_V2600_/os/linux/../../common/crypt_aes.c:1561:6: warning: format ‘%d’ expects argument of type ‘int’, but argument 2 has type ‘long unsigned int’ [-Wformat=]
      DBGPRINT(RT_DEBUG_ERROR, ("AES_Key_Unwrap: allocate %d bytes memory failure.\n", sizeof(UINT8)*PlainLength));
      ^
  CC [M]  /home/jojo/Bureau/DPOLinuxSTA_V2600_/os/linux/../../common/crypt_arc4.o
  CC [M]  /home/jojo/Bureau/DPOLinuxSTA_V2600_/os/linux/../../common/mlme.o
In file included from /home/jojo/Bureau/DPOLinuxSTA_V2600_/include/rtmp_os.h:42:0,
                 from /home/jojo/Bureau/DPOLinuxSTA_V2600_/include/rtmp_comm.h:56,
                 from /home/jojo/Bureau/DPOLinuxSTA_V2600_/include/rt_config.h:36,
                 from /home/jojo/Bureau/DPOLinuxSTA_V2600_/os/linux/../../common/mlme.c:30:
/home/jojo/Bureau/DPOLinuxSTA_V2600_/os/linux/../../common/mlme.c: In function ‘MlmeResetRalinkCounters’:
/home/jojo/Bureau/DPOLinuxSTA_V2600_/os/linux/../../common/mlme.c:529:7: warning: cast from pointer to integer of different size [-Wpointer-to-int-cast]
       (UINT32)&pAd->RalinkCounters.OneSecEnd -
       ^
/home/jojo/Bureau/DPOLinuxSTA_V2600_/include/os/rt_linux.h:463:76: note: in definition of macro ‘NdisZeroMemory’
 #define NdisZeroMemory(Destination, Length)         memset(Destination, 0, Length)
                                                                            ^
/home/jojo/Bureau/DPOLinuxSTA_V2600_/os/linux/../../common/mlme.c:530:7: warning: cast from pointer to integer of different size [-Wpointer-to-int-cast]
       (UINT32)&pAd->RalinkCounters.OneSecStart);
       ^
/home/jojo/Bureau/DPOLinuxSTA_V2600_/include/os/rt_linux.h:463:76: note: in definition of macro ‘NdisZeroMemory’
 #define NdisZeroMemory(Destination, Length)         memset(Destination, 0, Length)
                                                                            ^
  CC [M]  /home/jojo/Bureau/DPOLinuxSTA_V2600_/os/linux/../../common/cmm_wep.o
  CC [M]  /home/jojo/Bureau/DPOLinuxSTA_V2600_/os/linux/../../common/action.o
  CC [M]  /home/jojo/Bureau/DPOLinuxSTA_V2600_/os/linux/../../common/cmm_data.o
  CC [M]  /home/jojo/Bureau/DPOLinuxSTA_V2600_/os/linux/../../common/rtmp_init.o
  CC [M]  /home/jojo/Bureau/DPOLinuxSTA_V2600_/os/linux/../../common/rtmp_init_inf.o
/home/jojo/Bureau/DPOLinuxSTA_V2600_/os/linux/../../common/rtmp_init_inf.c: In function ‘rt28xx_init’:
/home/jojo/Bureau/DPOLinuxSTA_V2600_/os/linux/../../common/rtmp_init_inf.c:162:3: warning: format ‘%x’ expects argument of type ‘unsigned int’, but argument 2 has type ‘ULONG’ [-Wformat=]
   DBGPRINT(RT_DEBUG_OFF,("PllCtrl:0x%x\n",PllCtrl.word));
   ^
/home/jojo/Bureau/DPOLinuxSTA_V2600_/os/linux/../../common/rtmp_init_inf.c:178:10: warning: ISO C90 forbids mixed declarations and code [-Wdeclaration-after-statement]
          AUTO_WAKEUP_STRUC AutoWakeupCfg;
          ^
  CC [M]  /home/jojo/Bureau/DPOLinuxSTA_V2600_/os/linux/../../common/cmm_tkip.o
  CC [M]  /home/jojo/Bureau/DPOLinuxSTA_V2600_/os/linux/../../common/cmm_aes.o
  CC [M]  /home/jojo/Bureau/DPOLinuxSTA_V2600_/os/linux/../../common/cmm_sync.o
  CC [M]  /home/jojo/Bureau/DPOLinuxSTA_V2600_/os/linux/../../common/eeprom.o
  CC [M]  /home/jojo/Bureau/DPOLinuxSTA_V2600_/os/linux/../../common/cmm_sanity.o
  CC [M]  /home/jojo/Bureau/DPOLinuxSTA_V2600_/os/linux/../../common/cmm_info.o
  CC [M]  /home/jojo/Bureau/DPOLinuxSTA_V2600_/os/linux/../../common/cmm_cfg.o
  CC [M]  /home/jojo/Bureau/DPOLinuxSTA_V2600_/os/linux/../../common/cmm_wpa.o
/home/jojo/Bureau/DPOLinuxSTA_V2600_/os/linux/../../common/cmm_wpa.c: In function ‘PeerPairMsg3Action’:
/home/jojo/Bureau/DPOLinuxSTA_V2600_/os/linux/../../common/cmm_wpa.c:1032:13: warning: unused variable ‘Cancelled’ [-Wunused-variable]
  BOOLEAN    Cancelled;
             ^
  CC [M]  /home/jojo/Bureau/DPOLinuxSTA_V2600_/os/linux/../../common/cmm_radar.o
  CC [M]  /home/jojo/Bureau/DPOLinuxSTA_V2600_/os/linux/../../common/spectrum.o
/home/jojo/Bureau/DPOLinuxSTA_V2600_/os/linux/../../common/spectrum.c: In function ‘PeerMeasureReportAction’:
/home/jojo/Bureau/DPOLinuxSTA_V2600_/os/linux/../../common/spectrum.c:1972:3: warning: format ‘%d’ expects argument of type ‘int’, but argument 3 has type ‘long unsigned int’ [-Wformat=]
   DBGPRINT(RT_DEBUG_ERROR, ("%s unable to alloc memory for measure report buffer (size=%d).\n", __FUNCTION__, sizeof(MEASURE_RPI_REPORT)));
   ^
  CC [M]  /home/jojo/Bureau/DPOLinuxSTA_V2600_/os/linux/../../common/rtmp_timer.o
  CC [M]  /home/jojo/Bureau/DPOLinuxSTA_V2600_/os/linux/../../common/rt_channel.o
  CC [M]  /home/jojo/Bureau/DPOLinuxSTA_V2600_/os/linux/../../common/cmm_profile.o
  CC [M]  /home/jojo/Bureau/DPOLinuxSTA_V2600_/os/linux/../../common/cmm_asic.o
  CC [M]  /home/jojo/Bureau/DPOLinuxSTA_V2600_/os/linux/../../common/cmm_cmd.o
  CC [M]  /home/jojo/Bureau/DPOLinuxSTA_V2600_/os/linux/../../common/ps.o
  CC [M]  /home/jojo/Bureau/DPOLinuxSTA_V2600_/os/linux/../../common/uapsd.o
  CC [M]  /home/jojo/Bureau/DPOLinuxSTA_V2600_/os/linux/../../rate_ctrl/ra_ctrl.o
  CC [M]  /home/jojo/Bureau/DPOLinuxSTA_V2600_/os/linux/../../rate_ctrl/alg_legacy.o
  CC [M]  /home/jojo/Bureau/DPOLinuxSTA_V2600_/os/linux/../../rate_ctrl/alg_ags.o
  CC [M]  /home/jojo/Bureau/DPOLinuxSTA_V2600_/os/linux/../../os/linux/rt_profile.o
/home/jojo/Bureau/DPOLinuxSTA_V2600_/os/linux/../../os/linux/rt_profile.c: In function ‘STA_MonPktSend’:
/home/jojo/Bureau/DPOLinuxSTA_V2600_/os/linux/../../os/linux/rt_profile.c:409:9: warning: format ‘%d’ expects argument of type ‘int’, but argument 3 has type ‘long unsigned int’ [-Wformat=]
         DBGPRINT(RT_DEBUG_ERROR, ("%s : Size is too large! (%d)\n", __FUNCTION__, pRxBlk->DataSize + sizeof(wlan_ng_prism2_header)));
         ^
  CC [M]  /home/jojo/Bureau/DPOLinuxSTA_V2600_/os/linux/../../chips/rtmp_chip.o
  CC [M]  /home/jojo/Bureau/DPOLinuxSTA_V2600_/os/linux/../../sta/assoc.o
  CC [M]  /home/jojo/Bureau/DPOLinuxSTA_V2600_/os/linux/../../sta/auth.o
  CC [M]  /home/jojo/Bureau/DPOLinuxSTA_V2600_/os/linux/../../sta/auth_rsp.o
  CC [M]  /home/jojo/Bureau/DPOLinuxSTA_V2600_/os/linux/../../sta/sync.o
  CC [M]  /home/jojo/Bureau/DPOLinuxSTA_V2600_/os/linux/../../sta/sanity.o
  CC [M]  /home/jojo/Bureau/DPOLinuxSTA_V2600_/os/linux/../../sta/rtmp_data.o
/home/jojo/Bureau/DPOLinuxSTA_V2600_/os/linux/../../sta/rtmp_data.c: In function ‘STAHandleRxDataFrame’:
/home/jojo/Bureau/DPOLinuxSTA_V2600_/os/linux/../../sta/rtmp_data.c:283:17: warning: unused variable ‘pFmeCtrl’ [-Wunused-variable]
  FRAME_CONTROL *pFmeCtrl = &pHeader->FC;
                 ^
/home/jojo/Bureau/DPOLinuxSTA_V2600_/os/linux/../../sta/rtmp_data.c:282:8: warning: unused variable ‘OldPwrMgmt’ [-Wunused-variable]
  UCHAR OldPwrMgmt = PWR_ACTIVE;
        ^
/home/jojo/Bureau/DPOLinuxSTA_V2600_/os/linux/../../sta/rtmp_data.c: In function ‘STAHandleRxMgmtFrame’:
/home/jojo/Bureau/DPOLinuxSTA_V2600_/os/linux/../../sta/rtmp_data.c:766:5: warning: ISO C90 forbids mixed declarations and code [-Wdeclaration-after-statement]
     UCHAR uRSSI2;
     ^
  CC [M]  /home/jojo/Bureau/DPOLinuxSTA_V2600_/os/linux/../../sta/connect.o
  CC [M]  /home/jojo/Bureau/DPOLinuxSTA_V2600_/os/linux/../../sta/wpa.o
  CC [M]  /home/jojo/Bureau/DPOLinuxSTA_V2600_/os/linux/../../sta/sta_cfg.o
/home/jojo/Bureau/DPOLinuxSTA_V2600_/os/linux/../../sta/sta_cfg.c: In function ‘RTMPQueryInformation’:
/home/jojo/Bureau/DPOLinuxSTA_V2600_/os/linux/../../sta/sta_cfg.c:3956:4: warning: format ‘%d’ expects argument of type ‘int’, but argument 2 has type ‘long unsigned int’ [-Wformat=]
    DBGPRINT(RT_DEBUG_TRACE, ("sizeof UCHAR=%d, channel=%d \n", sizeof(UCHAR), pAd->CommonCfg.Channel));
    ^
/home/jojo/Bureau/DPOLinuxSTA_V2600_/os/linux/../../sta/sta_cfg.c: In function ‘RtmpIoctl_rt_private_get_statistics’:
/home/jojo/Bureau/DPOLinuxSTA_V2600_/os/linux/../../sta/sta_cfg.c:7220:1: warning: format ‘%x’ expects argument of type ‘unsigned int’, but argument 3 has type ‘EEPROM_NIC_CONFIG3_STRUC’ [-Wformat=]
 sprintf(extra+strlen(extra), "pAd->NicConfig3.field.CoexAnt == 0x%x\n\n",pAd->NicConfig3);
 ^
  CC [M]  /home/jojo/Bureau/DPOLinuxSTA_V2600_/os/linux/../../common/rt_os_util.o
  CC [M]  /home/jojo/Bureau/DPOLinuxSTA_V2600_/os/linux/../../os/linux/sta_ioctl.o
In file included from /home/jojo/Bureau/DPOLinuxSTA_V2600_/include/os/rt_linux.h:40:0,
                 from /home/jojo/Bureau/DPOLinuxSTA_V2600_/include/rtmp_os.h:42,
                 from /home/jojo/Bureau/DPOLinuxSTA_V2600_/include/rtmp_comm.h:56,
                 from /home/jojo/Bureau/DPOLinuxSTA_V2600_/os/linux/../../os/linux/sta_ioctl.c:33:
/home/jojo/Bureau/DPOLinuxSTA_V2600_/os/linux/../../os/linux/sta_ioctl.c: In function ‘rt_ioctl_giwscan’:
/usr/src/linux-headers-3.16.0-4-common/include/net/iw_handler.h:542:3: warning: array subscript is below array bounds [-Warray-bounds]
   memcpy(stream + point_len, extra, iwe->u.data.length);
   ^
  CC [M]  /home/jojo/Bureau/DPOLinuxSTA_V2600_/os/linux/../../os/linux/rt_linux.o
In file included from /home/jojo/Bureau/DPOLinuxSTA_V2600_/include/rtmp_os.h:42:0,
                 from /home/jojo/Bureau/DPOLinuxSTA_V2600_/include/rtmp_comm.h:56,
                 from /home/jojo/Bureau/DPOLinuxSTA_V2600_/os/linux/../../os/linux/rt_linux.c:35:
/home/jojo/Bureau/DPOLinuxSTA_V2600_/os/linux/../../os/linux/rt_linux.c: In function ‘duplicate_pkt’:
/home/jojo/Bureau/DPOLinuxSTA_V2600_/os/linux/../../os/linux/rt_linux.c:508:18: warning: passing argument 1 of ‘memmove’ makes pointer from integer without a cast
   NdisMoveMemory(skb->tail, pHeader802_3, HdrLen);
                  ^
/home/jojo/Bureau/DPOLinuxSTA_V2600_/include/os/rt_linux.h:461:61: note: in definition of macro ‘NdisMoveMemory’
 #define NdisMoveMemory(Destination, Source, Length) memmove(Destination, Source, Length)
                                                             ^
In file included from /usr/src/linux-headers-3.16.0-4-common/arch/x86/include/asm/string.h:4:0,
                 from /usr/src/linux-headers-3.16.0-4-common/include/linux/string.h:17,
                 from /usr/src/linux-headers-3.16.0-4-common/include/linux/bitmap.h:8,
                 from /usr/src/linux-headers-3.16.0-4-common/include/linux/cpumask.h:11,
                 from /usr/src/linux-headers-3.16.0-4-common/arch/x86/include/asm/cpumask.h:4,
                 from /usr/src/linux-headers-3.16.0-4-common/arch/x86/include/asm/msr.h:10,
                 from /usr/src/linux-headers-3.16.0-4-common/arch/x86/include/asm/processor.h:20,
                 from /usr/src/linux-headers-3.16.0-4-common/arch/x86/include/asm/thread_info.h:23,
                 from /usr/src/linux-headers-3.16.0-4-common/include/linux/thread_info.h:54,
                 from /usr/src/linux-headers-3.16.0-4-common/arch/x86/include/asm/preempt.h:6,
                 from /usr/src/linux-headers-3.16.0-4-common/include/linux/preempt.h:18,
                 from /usr/src/linux-headers-3.16.0-4-common/include/linux/spinlock.h:50,
                 from /usr/src/linux-headers-3.16.0-4-common/include/linux/seqlock.h:35,
                 from /usr/src/linux-headers-3.16.0-4-common/include/linux/time.h:5,
                 from /usr/src/linux-headers-3.16.0-4-common/include/linux/stat.h:18,
                 from /usr/src/linux-headers-3.16.0-4-common/include/linux/module.h:10,
                 from /home/jojo/Bureau/DPOLinuxSTA_V2600_/include/os/rt_linux.h:18,
                 from /home/jojo/Bureau/DPOLinuxSTA_V2600_/include/rtmp_os.h:42,
                 from /home/jojo/Bureau/DPOLinuxSTA_V2600_/include/rtmp_comm.h:56,
                 from /home/jojo/Bureau/DPOLinuxSTA_V2600_/os/linux/../../os/linux/rt_linux.c:35:
/usr/src/linux-headers-3.16.0-4-common/arch/x86/include/asm/string_64.h:58:7: note: expected ‘void *’ but argument is of type ‘sk_buff_data_t’
 void *memmove(void *dest, const void *src, size_t count);
       ^
In file included from /home/jojo/Bureau/DPOLinuxSTA_V2600_/include/rtmp_os.h:42:0,
                 from /home/jojo/Bureau/DPOLinuxSTA_V2600_/include/rtmp_comm.h:56,
                 from /home/jojo/Bureau/DPOLinuxSTA_V2600_/os/linux/../../os/linux/rt_linux.c:35:
/home/jojo/Bureau/DPOLinuxSTA_V2600_/os/linux/../../os/linux/rt_linux.c:510:18: warning: passing argument 1 of ‘memmove’ makes pointer from integer without a cast
   NdisMoveMemory(skb->tail, pData, DataSize);
                  ^
/home/jojo/Bureau/DPOLinuxSTA_V2600_/include/os/rt_linux.h:461:61: note: in definition of macro ‘NdisMoveMemory’
 #define NdisMoveMemory(Destination, Source, Length) memmove(Destination, Source, Length)
                                                             ^
In file included from /usr/src/linux-headers-3.16.0-4-common/arch/x86/include/asm/string.h:4:0,
                 from /usr/src/linux-headers-3.16.0-4-common/include/linux/string.h:17,
                 from /usr/src/linux-headers-3.16.0-4-common/include/linux/bitmap.h:8,
                 from /usr/src/linux-headers-3.16.0-4-common/include/linux/cpumask.h:11,
                 from /usr/src/linux-headers-3.16.0-4-common/arch/x86/include/asm/cpumask.h:4,
                 from /usr/src/linux-headers-3.16.0-4-common/arch/x86/include/asm/msr.h:10,
                 from /usr/src/linux-headers-3.16.0-4-common/arch/x86/include/asm/processor.h:20,
                 from /usr/src/linux-headers-3.16.0-4-common/arch/x86/include/asm/thread_info.h:23,
                 from /usr/src/linux-headers-3.16.0-4-common/include/linux/thread_info.h:54,
                 from /usr/src/linux-headers-3.16.0-4-common/arch/x86/include/asm/preempt.h:6,
                 from /usr/src/linux-headers-3.16.0-4-common/include/linux/preempt.h:18,
                 from /usr/src/linux-headers-3.16.0-4-common/include/linux/spinlock.h:50,
                 from /usr/src/linux-headers-3.16.0-4-common/include/linux/seqlock.h:35,
                 from /usr/src/linux-headers-3.16.0-4-common/include/linux/time.h:5,
                 from /usr/src/linux-headers-3.16.0-4-common/include/linux/stat.h:18,
                 from /usr/src/linux-headers-3.16.0-4-common/include/linux/module.h:10,
                 from /home/jojo/Bureau/DPOLinuxSTA_V2600_/include/os/rt_linux.h:18,
                 from /home/jojo/Bureau/DPOLinuxSTA_V2600_/include/rtmp_os.h:42,
                 from /home/jojo/Bureau/DPOLinuxSTA_V2600_/include/rtmp_comm.h:56,
                 from /home/jojo/Bureau/DPOLinuxSTA_V2600_/os/linux/../../os/linux/rt_linux.c:35:
/usr/src/linux-headers-3.16.0-4-common/arch/x86/include/asm/string_64.h:58:7: note: expected ‘void *’ but argument is of type ‘sk_buff_data_t’
 void *memmove(void *dest, const void *src, size_t count);
       ^
/home/jojo/Bureau/DPOLinuxSTA_V2600_/os/linux/../../os/linux/rt_linux.c: In function ‘ClonePacket’:
/home/jojo/Bureau/DPOLinuxSTA_V2600_/os/linux/../../os/linux/rt_linux.c:662:20: warning: assignment makes integer from pointer without a cast
   pClonedPkt->tail = pClonedPkt->data + pClonedPkt->len;
                    ^
In file included from /home/jojo/Bureau/DPOLinuxSTA_V2600_/include/rtmp_os.h:42:0,
                 from /home/jojo/Bureau/DPOLinuxSTA_V2600_/include/rtmp_comm.h:56,
                 from /home/jojo/Bureau/DPOLinuxSTA_V2600_/os/linux/../../os/linux/rt_linux.c:35:
/home/jojo/Bureau/DPOLinuxSTA_V2600_/os/linux/../../os/linux/rt_linux.c: In function ‘RtmpOsPktInit’:
/home/jojo/Bureau/DPOLinuxSTA_V2600_/include/os/rt_linux.h:992:34: warning: assignment makes integer from pointer without a cast
   ((RTPKT_TO_OSPKT(_pkt))->tail) = (PUCHAR)((_start) + (_len))
                                  ^
/home/jojo/Bureau/DPOLinuxSTA_V2600_/os/linux/../../os/linux/rt_linux.c:681:2: note: in expansion of macro ‘SET_OS_PKT_DATATAIL’
  SET_OS_PKT_DATATAIL(pRxPkt, pData, DataSize);
  ^
/home/jojo/Bureau/DPOLinuxSTA_V2600_/os/linux/../../os/linux/rt_linux.c: In function ‘wlan_802_11_to_802_3_packet’:
/home/jojo/Bureau/DPOLinuxSTA_V2600_/os/linux/../../os/linux/rt_linux.c:708:15: warning: assignment makes integer from pointer without a cast
  pOSPkt->tail = pOSPkt->data + pOSPkt->len;
               ^
/home/jojo/Bureau/DPOLinuxSTA_V2600_/os/linux/../../os/linux/rt_linux.c: In function ‘__RtmpOSFSInfoChange’:
/home/jojo/Bureau/DPOLinuxSTA_V2600_/os/linux/../../os/linux/rt_linux.c:1136:20: error: incompatible types when assigning to type ‘int’ from type ‘kuid_t’
   pOSFSInfo->fsuid = current_fsuid();
                    ^
/home/jojo/Bureau/DPOLinuxSTA_V2600_/os/linux/../../os/linux/rt_linux.c:1137:20: error: incompatible types when assigning to type ‘int’ from type ‘kgid_t’
   pOSFSInfo->fsgid = current_fsgid();
                    ^
/usr/src/linux-headers-3.16.0-4-common/scripts/Makefile.build:262: recipe for target '/home/jojo/Bureau/DPOLinuxSTA_V2600_/os/linux/../../os/linux/rt_linux.o' failed
make[4]: *** [/home/jojo/Bureau/DPOLinuxSTA_V2600_/os/linux/../../os/linux/rt_linux.o] Error 1
/usr/src/linux-headers-3.16.0-4-common/Makefile:1350: recipe for target '_module_/home/jojo/Bureau/DPOLinuxSTA_V2600_/os/linux' failed
make[3]: *** [_module_/home/jojo/Bureau/DPOLinuxSTA_V2600_/os/linux] Error 2
Makefile:181: recipe for target 'sub-make' failed
make[2]: *** [sub-make] Error 2
Makefile:8: recipe for target 'all' failed
make[1]: *** [all] Error 2
make[1]: Leaving directory '/usr/src/linux-headers-3.16.0-4-amd64'
Makefile:380: recipe for target 'LINUX' failed
make: *** [LINUX] Error 2
jojo@jojo:~/Bureau/DPOLinuxSTA_V2600_$
Quelqu'un aurait-il une information ?
Merci pour qui pourait m'aider. :?

Jojo
Laptop ASUS R510LDV
IntelCore I5-4210U/BGA, up to 2,7 GHz
Optimus - Nvidia ge force 820M
- intel Corporation Haswel-ULT integrated Graphics Controllers
Ram DDR3L1600 2G+4G
HDD 1TB 2.5' 5400R SATA
SOLYDX (et win 8.1) 64 bits

User avatar
belze
Posts: 221
Joined: 29 Sep 2014 16:31
Location: Torino, Italy

Re: La compilation ne fonctionne pas

Postby belze » 09 Mar 2015 13:15

pouvez vous donner des infos en plus?

Code: Select all

jojo@jojo:~/Bureau/DPOLinuxSTA_V2600_$ ./configure
bash: ./configure: Aucun fichier ou dossier de ce type
je vois que vous etes en train de installer quelque chose à propos de WiFi (je crois). Avez vous lit cet article? https://wiki.debian.org/fr/rt61pci
-------
Image

jojo 35
Posts: 98
Joined: 12 Aug 2013 07:39
Location: Région de Rennes

Re: La compilation ne fonctionne pas

Postby jojo 35 » 11 Mar 2015 12:33

Bonjour, ;)
belze wrote:pouvez vous donner des infos en plus?

Code: Select all

jojo@jojo:~/Bureau/DPOLinuxSTA_V2600_$ ./configure
bash: ./configure: Aucun fichier ou dossier de ce type
je vois que vous etes en train de installer quelque chose à propos de WiFi (je crois). Avez vous lit cet article? https://wiki.debian.org/fr/rt61pci
J'ai mon bluetooth qui ne fonctionne pas. La carte est une Realtek rt3290.
J'ai essayé la méthode Ubuntu, la méthode Débian, J'ai voulu aussi essayé la complilation, mais j'ai eu les problèmes cité plus haut.

Si tu veux des précision, n'hésite pas à me demander des précisions.

Merci pour l'aide.

Cordialement.

Jojo
Laptop ASUS R510LDV
IntelCore I5-4210U/BGA, up to 2,7 GHz
Optimus - Nvidia ge force 820M
- intel Corporation Haswel-ULT integrated Graphics Controllers
Ram DDR3L1600 2G+4G
HDD 1TB 2.5' 5400R SATA
SOLYDX (et win 8.1) 64 bits

User avatar
belze
Posts: 221
Joined: 29 Sep 2014 16:31
Location: Torino, Italy

Re: La compilation ne fonctionne pas

Postby belze » 11 Mar 2015 13:34

1- Excusez moi pour mon mouvais français
2- Confirmez moi que suivant https://wiki.debian.org/rt3290 ne resolve pas le probleme
3- Attaché les outputs des suivants:

Code: Select all

$ lspci | grep Network
+

Code: Select all

inxi -Nxx
J'ai aussi trouvé http://forums.linuxmint.com/viewtopic.php?f=49&t=172945 pouvez vous esseyer?
-------
Image

jojo 35
Posts: 98
Joined: 12 Aug 2013 07:39
Location: Région de Rennes

Re: La compilation ne fonctionne pas

Postby jojo 35 » 11 Mar 2015 19:01

belze wrote:1- Excusez moi pour mon mouvais français
Oui, il n'y a pas de problème ;)
2- Confirmez moi que suivant https://wiki.debian.org/rt3290 ne resolve pas le probleme
Oui je confirme que cela ne resoult pas mon problème de Bluetooth
3- Attaché les outputs des suivants:

Code: Select all

$ lspci | grep Network
jojo@jojo:~$ lspci | grep Network
03:00.0 Network controller: Ralink corp. RT3290 Wireless 802.11n 1T/1R PCIe
jojo@jojo:~$
+

Code: Select all

inxi -Nxx

Code: Select all

jojo@jojo:~$ inxi -Nxx
Network:   Card-1: Ralink RT3290 Wireless 802.11n 1T/1R PCIe driver: rt2860 bus-ID: 03:00.0 chip-ID: 1814:3290
           Card-2: Realtek RTL8111/8168/8411 PCI Express Gigabit Ethernet Controller
           driver: r8169 v: 2.3LK-NAPI port: e000 bus-ID: 02:00.1 chip-ID: 10ec:8168
jojo@jojo:~$ 
J'ai aussi trouvé http://forums.linuxmint.com/viewtopic.php?f=49&t=172945 pouvez vous esseyer?
Voila ce qu'il demande :

Code: Select all

jojo@jojo:~$ inxi -Fxz
System:    Host: jojo Kernel: 3.16.0-4-amd64 x86_64 (64 bit gcc: 4.8.4) Desktop: N/A Distro: SolydXK 1 solydxk 
Machine:   Mobo: ASUSTeK model: X550LD v: 1.0 Bios: American Megatrends v: X550LD.306 date: 05/14/2014
CPU:       Dual core Intel Core i5-4210U (-HT-MCP-) cache: 3072 KB
           flags: (lm nx sse sse2 sse3 sse4_1 sse4_2 ssse3 vmx) bmips: 9577 
           Clock Speeds: 1: 2057 MHz 2: 1804 MHz 3: 2338 MHz 4: 1743 MHz
Graphics:  Card-1: Intel Haswell-ULT Integrated Graphics Controller bus-ID: 00:02.0
           Card-2: NVIDIA GF117M [GeForce 610M/710M/820M / GT 620M/625M/630M/720M] bus-ID: 04:00.0
           Display Server: X.Org 1.16.4 drivers: intel (unloaded: fbdev,vesa) Resolution: 1366x768@60.01hz
           GLX Renderer: Mesa DRI Intel Haswell Mobile GLX Version: 3.0 Mesa 10.3.2 Direct Rendering: Yes
Audio:     Card-1 Intel 8 Series HD Audio Controller driver: snd_hda_intel bus-ID: 00:1b.0 
           Card-2 Intel Haswell-ULT HD Audio Controller driver: snd_hda_intel bus-ID: 00:03.0 
           Sound: Advanced Linux Sound Architecture v: k3.16.0-4-amd64
Network:   Card-1: Ralink RT3290 Wireless 802.11n 1T/1R PCIe driver: rt2860 bus-ID: 03:00.0
           IF: ra0 state: up mac: <filter>
           Card-2: Realtek RTL8111/8168/8411 PCI Express Gigabit Ethernet Controller
           driver: r8169 v: 2.3LK-NAPI port: e000 bus-ID: 02:00.1
           IF: eth0 state: down mac: <filter>
Drives:    HDD Total Size: 1000.2GB (19.4% used) ID-1: /dev/sda model: ST1000LM024_HN size: 1000.2GB
Partition: ID-1: / size: 106G used: 34G (34%) fs: ext4 dev: /dev/sda7 
           ID-2: swap-1 size: 10.49GB used: 0.00GB (0%) fs: swap dev: /dev/sda6 
Sensors:   System Temperatures: cpu: 40.0C mobo: N/A 
           Fan Speeds (in rpm): cpu: N/A 
Info:      Processes: 200 Uptime: 17 min Memory: 744.5/5867.4MB Init: systemd runlevel: 5 Gcc sys: 4.9.2 
           Client: Shell (bash 4.3.301) inxi: 2.1.28 
jojo@jojo:~$ 

Code: Select all

jojo@jojo:~$ lsusb
Bus 003 Device 003: ID 062a:0001 Creative Labs Notebook Optical Mouse
Bus 003 Device 002: ID 8087:8000 Intel Corp. 
Bus 003 Device 001: ID 1d6b:0002 Linux Foundation 2.0 root hub
Bus 002 Device 001: ID 1d6b:0003 Linux Foundation 3.0 root hub
Bus 001 Device 002: ID 0bda:57b4 Realtek Semiconductor Corp. 
Bus 001 Device 001: ID 1d6b:0002 Linux Foundation 2.0 root hub
jojo@jojo:~$ 
Je n'ai pas compris comment il avait fait, mon anglais est trop mauvais :?
Laptop ASUS R510LDV
IntelCore I5-4210U/BGA, up to 2,7 GHz
Optimus - Nvidia ge force 820M
- intel Corporation Haswel-ULT integrated Graphics Controllers
Ram DDR3L1600 2G+4G
HDD 1TB 2.5' 5400R SATA
SOLYDX (et win 8.1) 64 bits


Return to “Français (ATTENTION Archivage imminent)”

Who is online

Users browsing this forum: No registered users and 1 guest